Skip to content
View in the app

A better way to browse. Learn more.

Armbian Community Forums

A full-screen app on your home screen with push notifications, badges and more.

To install this app on iOS and iPadOS
  1. Tap the Share icon in Safari
  2. Scroll the menu and tap Add to Home Screen.
  3. Tap Add in the top-right corner.
To install this app on Android
  1. Tap the 3-dot menu (⋮) in the top-right corner of the browser.
  2. Tap Add to Home screen or Install app.
  3. Confirm by tapping Install.

Nano pi Core2 build failed

Featured Replies

[ o.k. ] Building deb [ armbian-config ]
[ o.k. ] Checking git sources [ armbian-config master ]
[ .... ] Up to date
[ o.k. ] Merging and packaging linux firmware [ @host ]
[ o.k. ] Checking git sources [ armbian-firmware-git master ]
[ .... ] Up to date
[ o.k. ] Merging and packaging linux firmware [ @host ]
[ o.k. ] Checking git sources [ armbian-firmware-git master ]
[ .... ] Up to date
[ o.k. ] Checking git sources [ linux-firmware-git master ]
[ .... ] Up to date
[ o.k. ] Creating board support package [ nanopineocore2 next ]
[ .... ] Fingerprinting
[ o.k. ] Building package [ linux-stretch-root-next-nanopineocore2 ]
[ o.k. ] Building desktop package [ armbian-stretch-desktop_5.98_all ]
[ o.k. ] Starting rootfs and image building process for [ nanopineocore2 stretch ]
[ o.k. ] Checking for local cache [ stretch-cli-arm64.6bf...e58.tar.lz4 ]
[ .... ] searching on servers
[ .... ] downloading using torrent network [ stretch-cli-arm64.6bf087ee11fbd8726089016fb0303e58.tar.lz4 ]

10/13 10:11:23 [ERROR] CUID#20 - Download aborted. URI=https://mirrors.dotsrc.org/armbian-dl/_rootfs/stretch-cli-arm64.6bf087ee11fbd8726089016fb0303e58.tar.lz4
Exception: [AbstractCommand.cc:351] errorCode=8 URI=https://mirrors.dotsrc.org/armbian-dl/_rootfs/stretch-cli-arm64.6bf087ee11fbd8726089016fb0303e58.tar.lz4
  -> [HttpResponse.cc:86] errorCode=8 Invalid range header. Request: 0-13107199/13107200, Response: 0-13107199/411989409
[#e43611 0B/12MiB(0%) CN:1 SD:0 DL:0B]
10/13 10:11:23 [ERROR] CUID#25 - Download aborted. URI=https://mirrors.netix.net/armbian/dl/_rootfs/stretch-cli-arm64.6bf087ee11fbd8726089016fb0303e58.tar.lz4
Exception: [AbstractCommand.cc:351] errorCode=8 URI=https://mirrors.netix.net/armbian/dl/_rootfs/stretch-cli-arm64.6bf087ee11fbd8726089016fb0303e58.tar.lz4
  -> [HttpResponse.cc:86] errorCode=8 Invalid range header. Request: 0-13107199/13107200, Response: 0-13107199/411989409
[#e43611 0B/12MiB(0%) CN:1 SD:0 DL:0B]
10/13 10:11:25 [ERROR] CUID#26 - Download aborted. URI=https://imola.armbian.com/_rootfs/stretch-cli-arm64.6bf087ee11fbd8726089016fb0303e58.tar.lz4
Exception: [AbstractCommand.cc:351] errorCode=8 URI=https://imola.armbian.com/_rootfs/stretch-cli-arm64.6bf087ee11fbd8726089016fb0303e58.tar.lz4
  -> [HttpResponse.cc:86] errorCode=8 Invalid range header. Request: 0-13107199/13107200, Response: 0-13107199/411989409
[#e43611 0B/12MiB(0%) CN:1 SD:0 DL:0B]
10/13 10:11:27 [ERROR] CUID#21 - Download aborted. URI=https://mirrors.tuna.tsinghua.edu.cn/armbian-releases/_rootfs/stretch-cli-arm64.6bf087ee11fbd8726089016fb0303e58.tar.lz4
Exception: [AbstractCommand.cc:351] errorCode=8 URI=https://mirrors.tuna.tsinghua.edu.cn/armbian-releases/_rootfs/stretch-cli-arm64.6bf087ee11fbd8726089016fb0303e58.tar.lz4
  -> [HttpResponse.cc:86] errorCode=8 Invalid range header. Request: 0-13107199/13107200, Response: 0-13107199/411989409

aria2 will resume download if the transfer is restarted.
If there are any errors, then see the log file. See '-l' option in help/man page for details.
[ .... ] downloading using http(s) network [ stretch-cli-arm64.6bf087ee11fbd8726089016fb0303e58.tar.lz4 ]

10/13 10:11:40 [ERROR] CUID#7 - Download aborted. URI=https://dl.armbian.com/_rootfs/stretch-cli-arm64.6bf087ee11fbd8726089016fb0303e58.tar.lz4
Exception: [AbstractCommand.cc:403] errorCode=1 URI=https://dl.armbian.com/_rootfs/stretch-cli-arm64.6bf087ee11fbd8726089016fb0303e58.tar.lz4
  -> [RequestGroup.cc:760] errorCode=1 Download aborted.
  -> [DefaultBtProgressInfoFile.cc:300] errorCode=1 total length mismatch. expected: 411989409, actual: 13107200

aria2 will resume download if the transfer is restarted.
If there are any errors, then see the log file. See '-l' option in help/man page for details.
[ error ] ERROR in function download_and_verify [ general.sh:995 ]
[ error ] verification failed
[ o.k. ] Process terminated
[ o.k. ] Unmounting [ /home/r1/build/.tmp/rootfs-next-nanopineocore2-stretch-no-no/ ]
[ error ] ERROR in function unmount_on_exit [ image-helpers.sh:66 ]
[ error ] debootstrap-ng was interrupted
[ o.k. ] Process terminated

 

  • Author

Thx! I disable download via torrent link

USE_TORRENT=no

(but I have direc connection without firewall. Torrent link no avialabel at the moment)

next  I have new problem

[ o.k. ] Starting rootfs and image building process for [ nanopineocore2 stretch ]
[ o.k. ] Checking for local cache [ stretch-cli-arm64.6bf...e58.tar.lz4 ]
[ o.k. ] Extracting stretch-cli-arm64.6bf...e58.tar.lz4 [ 0 days old ]
Error 44 : Unrecognized header : file cannot be decoded
[ .... ] stretch-cli-arm64.6bf...e58.tar.lz4: 68.0KiB [ 158MiB/s] [>                                                  ]  0%
tar: This does not look like a tar archive
tar: Exiting with failure status due to previous errors
[ error ] ERROR in function create_rootfs_cache [ debootstrap.sh:120 ]
[ error ] Cache /home/r1/build/cache/rootfs/stretch-cli-arm64.6bf087ee11fbd8726089016fb0303e58.tar.lz4 is corrupted and was deleted. Restart.
[ o.k. ] Process terminated
[ o.k. ] Unmounting [ /home/r1/build/.tmp/rootfs-next-nanopineocore2-stretch-no-no/ ]
[ error ] ERROR in function unmount_on_exit [ image-helpers.sh:66 ]
[ error ] debootstrap-ng was interrupted
[ o.k. ] Process terminated

 

Next I removed cache from build/cache/rootfs and well done!

Igor, thx for help!

Guest
This topic is now closed to further replies.

Account

Navigation

Search

Search

Configure browser push notifications

Chrome (Android)
  1. Tap the lock icon next to the address bar.
  2. Tap Permissions → Notifications.
  3. Adjust your preference.
Chrome (Desktop)
  1. Click the padlock icon in the address bar.
  2. Select Site settings.
  3. Find Notifications and adjust your preference.