Skip to content
View in the app

A better way to browse. Learn more.

Armbian Community Forums

A full-screen app on your home screen with push notifications, badges and more.

To install this app on iOS and iPadOS
  1. Tap the Share icon in Safari
  2. Scroll the menu and tap Add to Home Screen.
  3. Tap Add in the top-right corner.
To install this app on Android
  1. Tap the 3-dot menu (⋮) in the top-right corner of the browser.
  2. Tap Add to Home screen or Install app.
  3. Confirm by tapping Install.

Image Build Environment broken

Featured Replies

Tried latest build up to commit c195926

OPi+2E, Ubuntu xenial desktop, default kernel

Build failed with this

 Armbian building script, http://www.armbian.com | Author: Igor Pecovnik
 ──────────────────────────────────────────────────────────────────────────────
  ┌────────────────────────────────────────────────────────────────────────â”
  │ Compiling kernel...                                                    │  
  │────────────────────────────────────────────────────────────────────────│  
  │         &cec_phy_addr,                                                 │  
  │          ^                                                             │  
  │ drivers/video/sunxi/disp2/hdmi/aw/hdmi_cec.c:703:9: note: each undecla │  
  │ scripts/Makefile.build:313: recipe for target 'drivers/video/sunxi/dis │  
  │ make[4]: *** [drivers/video/sunxi/disp2/hdmi/aw/hdmi_cec.o] Error 1    │  
  │ scripts/Makefile.build:443: recipe for target 'drivers/video/sunxi/dis │  
  │ make[3]: *** [drivers/video/sunxi/disp2/hdmi] Error 2                  │  
  │ scripts/Makefile.build:443: recipe for target 'drivers/video/sunxi' fa │  
  │ make[2]: *** [drivers/video/sunxi] Error 2                             │  
  │ make[2]: *** Waiting for unfinished jobs....                           │  
  │ scripts/Makefile.build:443: recipe for target 'drivers/video' failed   │  
  │ make[1]: *** [drivers/video] Error 2                                   │  
  │ Makefile:948: recipe for target 'drivers' failed                       │  
  │ make: *** [drivers] Error 2                                            │  
  └────────────────────────────────────────────────────────────────────────┘  
    


[ error ] ERROR in function compile_kernel [ common.sh:254 ]
[ error ] Kernel was not built [ @host ]
[ o.k. ] Process terminated 

Hi all,

Tried to compile for OrangePiPlus and got the same error:

 
  x Makefile:948: recipe for target 'drivers' failed                       x
  x make: *** [drivers] Error 2 
Guest
This topic is now closed to further replies.

Account

Navigation

Search

Search

Configure browser push notifications

Chrome (Android)
  1. Tap the lock icon next to the address bar.
  2. Tap Permissions → Notifications.
  3. Adjust your preference.
Chrome (Desktop)
  1. Click the padlock icon in the address bar.
  2. Select Site settings.
  3. Find Notifications and adjust your preference.